BDBM50401442 CHEMBL2203768
SMILES COCCN1CCN(CC1)c1ccc(cc1)-c1nc2ncc(Br)c(N3CCN(Cc4cc(C)on4)CC3)c2[nH]1
InChI Key InChIKey=HDSVJYMJPXJMOL-UHFFFAOYSA-N
Data  1 IC50
  Tab Delimited (TSV)   2D SDfile   Computed 3D by Vconf -m prep SDfile
Find this compound or compounds like it in BindingDB:
Activity Spreadsheet -- Enzyme Inhibition Constant Data from BindingDB
Found 1 hit for monomerid = 50401442
TargetAurora kinase A(Homo sapiens (Human))
The Institute Of Cancer Research
Curated by ChEMBL
LigandPNGBDBM50401442(CHEMBL2203768)
Affinity DataIC50:  12nM. Assay description: Binding affinity to Aurora A kinase
In DepthDetails ArticlePubMed