BDBM50401445 CHEMBL2203765
SMILES Cc1cc(CN2CCN(CC2)c2c(Br)cnc3nc([nH]c23)-c2ccc(cc2)N2CCOCC2)no1
InChI Key InChIKey=QMNYBHANABNQLH-UHFFFAOYSA-N
Data  2 IC50
  Tab Delimited (TSV)   2D SDfile   Computed 3D by Vconf -m prep SDfile
Find this compound or compounds like it in BindingDB:
Activity Spreadsheet -- Enzyme Inhibition Constant Data from BindingDB
Found 2 hits for monomerid = 50401445
TargetPotassium voltage-gated channel subfamily H member 2(Homo sapiens (Human))
The Institute Of Cancer Research
Curated by ChEMBL
LigandPNGBDBM50401445(CHEMBL2203765)
Affinity DataIC50: >3.30E+4nM. Assay description: Inhibition of human ERG by whole-cell voltage clamping
In DepthDetails ArticlePubMed
TargetAurora kinase A(Homo sapiens (Human))
The Institute Of Cancer Research
Curated by ChEMBL
LigandPNGBDBM50401445(CHEMBL2203765)
Affinity DataIC50:  7nM. Assay description: Binding affinity to Aurora A kinase
In DepthDetails ArticlePubMed