BDBM50401588 CHEMBL1441254
SMILES COc1ccc(Oc2c(Cl)cnn(-c3ccccc3)c2=O)cc1
InChI Key InChIKey=CDMJYZVKNAEVQP-UHFFFAOYSA-N
Data  1 IC50
  Tab Delimited (TSV)   2D SDfile   Computed 3D by Vconf -m prep SDfile
Find this compound or compounds like it in BindingDB:
Activity Spreadsheet -- Enzyme Inhibition Constant Data from BindingDB
Found 1 hit for monomerid = 50401588
TargetNeuropeptides B/W receptor type 1(Homo sapiens (Human))
The Scripps Research Institute
Curated by ChEMBL
LigandPNGBDBM50401588(CHEMBL1441254)
Affinity DataIC50:  1.30E+4nM. Assay description: Antagonist activity at human NPBWR1 expressed in HEK293T cells co-expressing Galphaqi3 assessed as calcium release after 15 mins by FLIPR assay assay
In DepthDetails ArticlePubMed