BDBM50401623 CHEMBL2203848
SMILES CNc1cc(Nc2cnc(C#N)c(O[C@@H]3CCNC3)n2)ncc1C(=O)OC
InChI Key InChIKey=RPKFIDRFOABFMW-SNVBAGLBSA-N
Data  3 IC50
  Tab Delimited (TSV)   2D SDfile   Computed 3D by Vconf -m prep SDfile
Find this compound or compounds like it in BindingDB:
Activity Spreadsheet -- Enzyme Inhibition Constant Data from BindingDB
Found 3 hits for monomerid = 50401623
TargetSerine/threonine-protein kinase Chk1(Homo sapiens (Human))
The Institute Of Cancer Research
Curated by ChEMBL
LigandPNGBDBM50401623(CHEMBL2203848)
Affinity DataIC50:  5.40nM. Assay description: Inhibition of CHK1 using 5-FAM-KKKVSRSGLYRSPSMPENLNRPR-COOH as substrate after 1 hr by microfluidic assay in presence of ATP
In DepthDetails ArticlePubMed
TargetPotassium voltage-gated channel subfamily H member 2(Homo sapiens (Human))
The Institute Of Cancer Research
Curated by ChEMBL
LigandPNGBDBM50401623(CHEMBL2203848)
Affinity DataIC50:  1.60E+4nM. Assay description: Inhibition of human ERG overexpressed in HEK cells
In DepthDetails ArticlePubMed
TargetSerine/threonine-protein kinase Chk1(Homo sapiens (Human))
The Institute Of Cancer Research
Curated by ChEMBL
LigandPNGBDBM50401623(CHEMBL2203848)
Affinity DataIC50:  28nM. Assay description: Inhibition of CHK1 in human HT-29 cells assessed as etoposide-induced G2 check point arrest after 21 hrs by ELISA
In DepthDetails ArticlePubMed