BDBM50401722 CHEMBL2206517
SMILES CCc1ccc2C(CN(C)Cc2c1)c1ccccc1
InChI Key InChIKey=PPWGBAKMSRMGKP-UHFFFAOYSA-N
Data  3 KI
  Tab Delimited (TSV)   2D SDfile   Computed 3D by Vconf -m prep SDfile
Find this compound or compounds like it in BindingDB:
Activity Spreadsheet -- Enzyme Inhibition Constant Data from BindingDB
Found 3 hits for monomerid = 50401722
TargetSodium-dependent noradrenaline transporter(Homo sapiens (Human))
Amri
Curated by ChEMBL
LigandPNGBDBM50401722(CHEMBL2206517)
Affinity DataKi:  54nM. Assay description: Inhibition of human NET
In DepthDetails ArticlePubMed
TargetSodium-dependent dopamine transporter(Homo sapiens (Human))
Amri
Curated by ChEMBL
LigandPNGBDBM50401722(CHEMBL2206517)
Affinity DataKi:  233nM. Assay description: Inhibition of DAT
In DepthDetails ArticlePubMed
TargetSodium-dependent serotonin transporter(Homo sapiens (Human))
Amri
Curated by ChEMBL
LigandPNGBDBM50401722(CHEMBL2206517)
Affinity DataKi:  767nM. Assay description: Inhibition of SERT
In DepthDetails ArticlePubMed