BDBM50401864 CHEMBL2205392
SMILES COc1ccc(O[C@@H]2O[C@H](CO)[C@@H](O)[C@H]2O)cc1
InChI Key InChIKey=GHGSPMGBZLYLCB-DDHJBXDOSA-N
Data  1 IC50
  Tab Delimited (TSV)   2D SDfile   Computed 3D by Vconf -m prep SDfile
Find this compound or compounds like it in BindingDB:
Activity Spreadsheet -- Enzyme Inhibition Constant Data from BindingDB
Found 1 hit for monomerid = 50401864
TargetProto-oncogene tyrosine-protein kinase Src(Homo sapiens (Human))
University Of Delhi
Curated by ChEMBL
LigandPNGBDBM50401864(CHEMBL2205392)
Affinity DataIC50:  4.84E+5nM. Assay description: Inhibition of GST-tagged c-Src preincubated for 30 mins measured after 60 mins
In DepthDetails ArticlePubMed