BDBM50402021 CHEMBL2205458
SMILES CC(C)(C)Nc1c(Nc2ccnc(Nc3ccc-4c(Cc5ccccc-45)c3)n2)c(=O)c1=O
InChI Key InChIKey=DZSCOPNYGJCJSL-UHFFFAOYSA-N
Data  1 KI  1 EC50
  Tab Delimited (TSV)   2D SDfile   Computed 3D by Vconf -m prep SDfile
Find this compound or compounds like it in BindingDB:
Activity Spreadsheet -- Enzyme Inhibition Constant Data from BindingDB
Found 2 hits for monomerid = 50402021
TargetSerine/threonine-protein kinase PLK1(Homo sapiens (Human))
Abbott Laboratories
Curated by ChEMBL
LigandPNGBDBM50402021(CHEMBL2205458)
Affinity DataKi:  4nM. Assay description: Inhibition of recombinant GST-tagged PLK1 using biotin-ahx-AKMETTFYDDALNASFLPSEKKK-amide as substrate after 30 mins by scintillation counting analysi...
In DepthDetails ArticlePubMed
TargetSerine/threonine-protein kinase PLK1(Homo sapiens (Human))
Abbott Laboratories
Curated by ChEMBL
LigandPNGBDBM50402021(CHEMBL2205458)
Affinity DataEC50: >3.00E+4nM. Assay description: Inhibition of PLK1 in human MIAPaCa2 cells after 48 hrs by MTT assay
In DepthDetails ArticlePubMed