BDBM50402065 CHEMBL2205448
SMILES C[C@H](Nc1c(Nc2ccnc(Nc3ccc(cc3)-c3ccccc3)n2)c(=O)c1=O)C(C)(C)C
InChI Key InChIKey=HPJJYTDVYAAQIR-INIZCTEOSA-N
Data  1 KI
  Tab Delimited (TSV)   2D SDfile   Computed 3D by Vconf -m prep SDfile
Find this compound or compounds like it in BindingDB:
Activity Spreadsheet -- Enzyme Inhibition Constant Data from BindingDB
Found 1 hit for monomerid = 50402065
TargetSerine/threonine-protein kinase PLK1(Homo sapiens (Human))
Abbott Laboratories
Curated by ChEMBL
LigandPNGBDBM50402065(CHEMBL2205448)
Affinity DataKi:  47nM. Assay description: Inhibition of PLK1 in human MIAPaCa2 cells after 48 hrs by MTT assay
In DepthDetails ArticlePubMed