BDBM50402365 CHEMBL2206697
SMILES Nc1c(cc(-c2ccccc2)n1-c1cccc(Br)c1)-c1nc2ccccc2[nH]1
InChI Key InChIKey=ISKVDOBRVVJLLJ-UHFFFAOYSA-N
Data  1 KI
  Tab Delimited (TSV)   2D SDfile   Computed 3D by Vconf -m prep SDfile
Find this compound or compounds like it in BindingDB:
Activity Spreadsheet -- Enzyme Inhibition Constant Data from BindingDB
Found 1 hit for monomerid = 50402365
TargetUrokinase plasminogen activator surface receptor(Homo sapiens (Human))
National Research Center
Curated by ChEMBL
LigandPNGBDBM50402365(CHEMBL2206697)
Affinity DataKi:  0.0120nM. Assay description: Binding affinity to uPAR
In DepthDetails ArticlePubMed