BDBM50402440 CHEMBL2208305
SMILES [#7]\[#6](-[#7])=[#7]\[#6]-[#6]-[#6]-[#6@@H](-[#7]-[#6](=O)C12[#6]-[#6]-3-[#6]-[#6](-[#6]-[#6](-[#6]-3)-[#6]1)-[#6]2)-[#6](=O)-[#7]-[#6@@H](-[#6]-c1ccccc1)-[#6](-[#7])=O
InChI Key InChIKey=UMKHUSRDQFQHAK-ULFQWXAWSA-N
Data  2 KI
  Tab Delimited (TSV)   2D SDfile   Computed 3D by Vconf -m prep SDfile
Find this compound or compounds like it in BindingDB:
Activity Spreadsheet -- Enzyme Inhibition Constant Data from BindingDB
Found 2 hits for monomerid = 50402440
TargetNeuropeptide FF receptor 1(Homo sapiens (Human))
University Of Strasbourg
Curated by ChEMBL
LigandPNGBDBM50402440(CHEMBL2208305)
Affinity DataKi:  29nM. Assay description: Displacement of [3H]FFRF-NH2 from human flag-tagged NPFF1 receptor expressed in CHO cells by scintillation counting
In DepthDetails ArticlePubMed
TargetNeuropeptide FF receptor 2(Homo sapiens (Human))
University Of Strasbourg
Curated by ChEMBL
LigandPNGBDBM50402440(CHEMBL2208305)
Affinity DataKi:  142nM. Assay description: Displacement of [3H]FFRF-NH2 from human flag-tagged NPFF2 receptor expressed in CHO cells by scintillation counting
In DepthDetails ArticlePubMed