BDBM50402508 CHEMBL2204842
SMILES CNC(=O)[C@H](CCC(O)=O)NC(=O)[C@H](CC(O)=O)NCC(O)=O
InChI Key InChIKey=ZOMDROUHNOCDLL-BQBZGAKWSA-N
Data  1 IC50
  Tab Delimited (TSV)   2D SDfile   Computed 3D by Vconf -m prep SDfile
Find this compound or compounds like it in BindingDB:
Activity Spreadsheet -- Enzyme Inhibition Constant Data from BindingDB
Found 1 hit for monomerid = 50402508
TargetBone morphogenetic protein 1(Homo sapiens (Human))
Fibrogen
Curated by ChEMBL
LigandPNGBDBM50402508(CHEMBL2204842)
Affinity DataIC50:  1.50E+6nM. Assay description: Inhibition of PCP after 1 hr by fluorescence assay
In DepthDetails ArticlePubMed