BDBM50402550 CHEMBL2204828
SMILES COc1ccc(CCN(CC(=O)NO)S(=O)(=O)c2ccc(OC)cc2)cc1
InChI Key InChIKey=CJXFMZZXKYQAND-UHFFFAOYSA-N
Data  1 IC50
  Tab Delimited (TSV)   2D SDfile   Computed 3D by Vconf -m prep SDfile
Find this compound or compounds like it in BindingDB:
Activity Spreadsheet -- Enzyme Inhibition Constant Data from BindingDB
Found 1 hit for monomerid = 50402550
TargetBone morphogenetic protein 1(Homo sapiens (Human))
Fibrogen
Curated by ChEMBL
LigandPNGBDBM50402550(CHEMBL2204828)
Affinity DataIC50:  1.80E+4nM. Assay description: Inhibition of PCP after 1 hr by fluorescence assay
In DepthDetails ArticlePubMed