BDBM50402590 CHEMBL2205576
SMILES COc1cccc2cc(C(=O)\C=C\c3cc[n+](Cc4cccc(F)c4)cc3)c(=O)oc12
InChI Key InChIKey=ADCUEIMTHWIRPV-CMDGGOBGSA-N
Data  2 IC50
  Tab Delimited (TSV)   2D SDfile   Computed 3D by Vconf -m prep SDfile
Find this compound or compounds like it in BindingDB:
Activity Spreadsheet -- Enzyme Inhibition Constant Data from BindingDB
Found 2 hits for monomerid = 50402590
TargetAcetylcholinesterase(Electrophorus electricus (Electric eel))
University College Of Science
Curated by ChEMBL
LigandPNGBDBM50402590(CHEMBL2205576)
Affinity DataIC50:  0.470nM. Assay description: Inhibition of electric eel AChE using acetylthiocholine iodide as substrate by Ellman's method
In DepthDetails ArticlePubMed
TargetCholinesterase(Equus caballus (Horse))
University College Of Science
Curated by ChEMBL
LigandPNGBDBM50402590(CHEMBL2205576)
Affinity DataIC50:  2.10E+3nM. Assay description: Inhibition of equine serum BuChE using acetylthiocholine iodide as substrate by Ellman's method
In DepthDetails ArticlePubMed