BDBM50402986 CHEMBL2206828
SMILES O[C@H]1CN[C@H](CNC2CCCC2)[C@H]1O
InChI Key InChIKey=CAYLVMUUXWDLQS-KXUCPTDWSA-N
Data  2 KI
  Tab Delimited (TSV)   2D SDfile   Computed 3D by Vconf -m prep SDfile
Find this compound or compounds like it in BindingDB:
Activity Spreadsheet -- Enzyme Inhibition Constant Data from BindingDB
Found 2 hits for monomerid = 50402986
TargetEndoplasmic reticulum mannosyl-oligosaccharide 1,2-alpha-mannosidase(Homo sapiens (Human))
Universidade Do Porto 687
Curated by ChEMBL
LigandPNGBDBM50402986(CHEMBL2206828)
Affinity DataKi:  6.69E+4nM. Assay description: Inhibition of human ER alpha mannosidase 1
In DepthDetails ArticlePubMed
TargetAlpha-mannosidase 2(Homo sapiens (Human))
Universidade Do Porto 687
Curated by ChEMBL
LigandPNGBDBM50402986(CHEMBL2206828)
Affinity DataKi:  3.33E+5nM. Assay description: Inhibition of human golgi alpha mannosidase 2
In DepthDetails ArticlePubMed