BDBM50403071 CHEMBL2216887
SMILES CC(c1nc2n(C)nc(Br)c2c(=O)n1-c1ccccc1)n1cnc2c(N)ncnc12
InChI Key InChIKey=CPQLXZTVSCHWPG-UHFFFAOYSA-N
Data  1 IC50
  Tab Delimited (TSV)   2D SDfile   Computed 3D by Vconf -m prep SDfile
Find this compound or compounds like it in BindingDB:
Activity Spreadsheet -- Enzyme Inhibition Constant Data from BindingDB
Found 1 hit for monomerid = 50403071
LigandPNGBDBM50403071(CHEMBL2216887)
Affinity DataIC50:  665nM. Assay description: Inhibition of PI3Kdelta in neutrophil assessed as elastase release by cell-based assay
In DepthDetails ArticlePubMed