BDBM50403110 CHEMBL179085
SMILES OC[C@@H]1NC[C@H](O)[C@H](O)[C@H]1O
InChI Key InChIKey=LXBIFEVIBLOUGU-BXKVDMCESA-N
Data  1 KI
  Tab Delimited (TSV)   2D SDfile   Computed 3D by Vconf -m prep SDfile
Find this compound or compounds like it in BindingDB:
Activity Spreadsheet -- Enzyme Inhibition Constant Data from BindingDB
Found 1 hit for monomerid = 50403110
TargetTissue alpha-L-fucosidase(Homo sapiens (Human))
TBA
Curated by ChEMBL
LigandPNGBDBM50403110(CHEMBL179085)
Affinity DataKi:  9.00E+7nM. Assay description: Inhibition constant against Alpha-Fucosidase
In DepthDetails Article