BDBM50403470 CHEMBL4172371
SMILES Cl.Cl.CSCC[C@H](N)C(=O)NCc1cccc(CNC(C)=N)c1
InChI Key InChIKey=SSLBUOVBFKPQMF-FCHUYYIVSA-N
Data  1 IC50
  Tab Delimited (TSV)   2D SDfile   Computed 3D by Vconf -m prep SDfile
Find this compound or compounds like it in BindingDB:
Activity Spreadsheet -- Enzyme Inhibition Constant Data from BindingDB
Found 1 hit for monomerid = 50403470
TargetNitric oxide synthase, inducible(Mus musculus (mouse))
University Of Chieti "G. D'Annunzio
Curated by ChEMBL
LigandPNGBDBM50403470(CHEMBL4172371)
Affinity DataIC50: >1.00E+4nM. Assay description: Inhibition of recombinant mouse iNOS using [3H]L-arginine as substrate preincubated for 15 mins followed by NADPH addition measured after 20 mins in ...
In DepthDetails ArticlePubMed