BDBM50403593 CHEMBL2111596
SMILES OC(=O)[C@@H]1Cc2cccc3CC[C@@H](NC(=O)[C@@H](S)Cc4ccccc4)C(=O)N1c23
InChI Key InChIKey=JXCFHCFAYKJVSI-SQNIBIBYSA-N
Data  2 IC50
  Tab Delimited (TSV)   2D SDfile   Computed 3D by Vconf -m prep SDfile
Find this compound or compounds like it in BindingDB:
Activity Spreadsheet -- Enzyme Inhibition Constant Data from BindingDB
Found 2 hits for monomerid = 50403593
TargetNeprilysin(Homo sapiens (Human))
TBA
Curated by ChEMBL
LigandPNGBDBM50403593(CHEMBL2111596)
Affinity DataIC50: >1.00E+3nM. Assay description: Inhibition of neutral endopeptidase
In DepthDetails Article
TargetAngiotensin-converting enzyme 2(Homo sapiens (Human))
TBA
Curated by ChEMBL
LigandPNGBDBM50403593(CHEMBL2111596)
Affinity DataIC50:  62nM. Assay description: Inhibition of Angiotensin I converting enzyme
In DepthDetails Article