BDBM50403604 CHEMBL4167999
SMILES COc1ccc(NC(=O)CN2CCN(Cc3ccc4CN(Cc4c3)C(=O)c3cc(C(C)C)c(O)cc3O)CC2)cc1Nc1ncc(Cl)c(Nc2ccccc2S(=O)(=O)C(C)C)n1
InChI Key InChIKey=JOZTXLKBELNSQL-MXTKCAFNSA-N
Data  3 IC50
  Tab Delimited (TSV)   2D SDfile   Computed 3D by Vconf -m prep SDfile
Find this compound or compounds like it in BindingDB:
Activity Spreadsheet -- Enzyme Inhibition Constant Data from BindingDB
Found 3 hits for monomerid = 50403604
TargetALK tyrosine kinase receptor(Homo sapiens (Human))
Chinese Academy Of Sciences
Curated by ChEMBL
LigandPNGBDBM50403604(CHEMBL4167999)
Affinity DataIC50:  9.80nM. Assay description: Inhibition of recombinant ALK (unknown origin) using poly (Glu,Tyr)4:1 as substrate after 60 mins by ELISA
In DepthDetails ArticlePubMed
TargetALK tyrosine kinase receptor(Homo sapiens (Human))
Chinese Academy Of Sciences
Curated by ChEMBL
LigandPNGBDBM50403604(CHEMBL4167999)
Affinity DataIC50:  6nM. Assay description: Inhibition of ALK L1196M mutant (unknown origin) using poly (Glu,Tyr)4:1 as substrate after 60 mins by ELISA
In DepthDetails ArticlePubMed
TargetHeat shock protein HSP 90-alpha(Homo sapiens (Human))
Chinese Academy Of Sciences
Curated by ChEMBL
LigandPNGBDBM50403604(CHEMBL4167999)
Affinity DataIC50:  40nM. Assay description: Inhibition of FITC-labeled geldanamycin binding to recombinant HSP90alpha (unknown origin) after 1 hr by fluorescence polarization assay
In DepthDetails ArticlePubMed