BDBM50403650 CHEMBL4162888
SMILES CC(C)c1cc(-c2onc(C(=O)NCC(=O)Nc3cccc(Nc4ncc(Cl)c(Nc5ccccc5S(=O)(=O)C(C)C)n4)c3)c2-c2ccc(CN3CCOCC3)cc2)c(O)cc1O
InChI Key InChIKey=FNKMCGSVNLLYKM-UHFFFAOYSA-N
Data  2 IC50
  Tab Delimited (TSV)   2D SDfile   Computed 3D by Vconf -m prep SDfile
Find this compound or compounds like it in BindingDB:
Activity Spreadsheet -- Enzyme Inhibition Constant Data from BindingDB
Found 2 hits for monomerid = 50403650
TargetALK tyrosine kinase receptor(Homo sapiens (Human))
Chinese Academy Of Sciences
Curated by ChEMBL
LigandPNGBDBM50403650(CHEMBL4162888)
Affinity DataIC50:  54nM. Assay description: Inhibition of recombinant ALK (unknown origin) using poly (Glu,Tyr)4:1 as substrate after 60 mins by ELISA
In DepthDetails ArticlePubMed
TargetHeat shock protein HSP 90-alpha(Homo sapiens (Human))
Chinese Academy Of Sciences
Curated by ChEMBL
LigandPNGBDBM50403650(CHEMBL4162888)
Affinity DataIC50: >1.00E+3nM. Assay description: Inhibition of FITC-labeled geldanamycin binding to recombinant HSP90alpha (unknown origin) after 1 hr by fluorescence polarization assay
In DepthDetails ArticlePubMed