BDBM50403703 CHEMBL37203
SMILES CC(C)[C@@H]1OC(=O)[C@@H](C)[C@@H](C)OC(=O)C[C@@H](O)[C@H](Cc2ccccc2)N(C)C1=O
InChI Key InChIKey=PBDWEPPZSHZNKO-HOXSDCPRSA-N
Data  2 IC50
  Tab Delimited (TSV)   2D SDfile   Computed 3D by Vconf -m prep SDfile
Find this compound or compounds like it in BindingDB:
Activity Spreadsheet -- Enzyme Inhibition Constant Data from BindingDB
Found 2 hits for monomerid = 50403703
TargetATP-dependent translocase ABCB1(Homo sapiens (Human))
Eisai Research Institute
Curated by ChEMBL
LigandPNGBDBM50403703(CHEMBL37203)
Affinity DataIC50:  1.50E+4nM. Assay description: Multidrug-resistant reversal activity using P388/VMDRC.04 cells (a subline of P388 murine leukemia cells expressing human recombinant human P-glycopr...
In DepthDetails ArticlePubMed
TargetATP-dependent translocase ABCB1(Homo sapiens (Human))
Eisai Research Institute
Curated by ChEMBL
LigandPNGBDBM50403703(CHEMBL37203)
Affinity DataIC50: >1.00E+5nM. Assay description: Multidrug-resistant reversal activity using P388/VMDRC.04 cells (a subline of P388 murine leukemia cells expressing human recombinant human P-glycopr...
In DepthDetails ArticlePubMed