BDBM50403953 CHEMBL2112368
SMILES COc1ccc(OC(F)(F)F)cc1[C@H]1COC2(C1)CCCN[C@H]2c1ccccc1
InChI Key InChIKey=GLCIVEUJSREFOQ-DPVFXHEMSA-N
Data  1 IC50
  Tab Delimited (TSV)   2D SDfile   Computed 3D by Vconf -m prep SDfile
Find this compound or compounds like it in BindingDB:
Activity Spreadsheet -- Enzyme Inhibition Constant Data from BindingDB
Found 1 hit for monomerid = 50403953
TargetSubstance-P receptor(Homo sapiens (Human))
Merck Sharp & Dohme Research Laboratories
Curated by ChEMBL
LigandPNGBDBM50403953(CHEMBL2112368)
Affinity DataIC50:  0.300nM. Assay description: Displacement of [125I]-labeled substance P from the cloned human Tachykinin receptor 1 expressed in CHO cells
In DepthDetails ArticlePubMed