BDBM50403991 CHEMBL315834
SMILES CN(C)CC1CC2N(O1)c1cccc(F)c1Cc1ccccc21
InChI Key InChIKey=QBPDZEVGAGDUQY-UHFFFAOYSA-N
Data  3 IC50
  Tab Delimited (TSV)   2D SDfile   Computed 3D by Vconf -m prep SDfile
Find this compound or compounds like it in BindingDB:
Activity Spreadsheet -- Enzyme Inhibition Constant Data from BindingDB
Found 3 hits for monomerid = 50403991
TargetHistamine H1 receptor(Homo sapiens (Human))
Janssen-Cilag
Curated by ChEMBL
LigandPNGBDBM50403991(CHEMBL315834)
Affinity DataIC50:  1.70nM. Assay description: Binding affinity at human cloned Histamine H1 receptor expressed in CHO cells by [3H]pyrilamine displacement.
In DepthDetails ArticlePubMed
Target5-hydroxytryptamine receptor 2C(Homo sapiens (Human))
Janssen-Cilag
Curated by ChEMBL
LigandPNGBDBM50403991(CHEMBL315834)
Affinity DataIC50:  5nM. Assay description: Binding affinity at human cloned 5-hydroxytryptamine 2C receptor expressed in CHO cells by [3H]mesulergine displacement.
In DepthDetails ArticlePubMed
Target5-hydroxytryptamine receptor 2A(Homo sapiens (Human))
Janssen-Cilag
Curated by ChEMBL
LigandPNGBDBM50403991(CHEMBL315834)
Affinity DataIC50:  24nM. Assay description: Binding affinity at human cloned 5-hydroxytryptamine 2A receptor expressed in L929 cells by [125I]R91150 displacement.
In DepthDetails ArticlePubMed