BDBM50404075 CHEMBL4176523
SMILES CNC(=O)c1cc(I)c(c(I)c1O)-n1cccc1
InChI Key InChIKey=OYVPMOPWCCUAPI-UHFFFAOYSA-N
Data  1 Kd
  Tab Delimited (TSV)   2D SDfile   Computed 3D by Vconf -m prep SDfile
Find this compound or compounds like it in BindingDB:
Activity Spreadsheet -- Enzyme Inhibition Constant Data from BindingDB
Found 1 hit for monomerid = 50404075
TargetCellular tumor antigen p53(Homo sapiens (Human))
University Of Southampton
Curated by ChEMBL
LigandPNGBDBM50404075(CHEMBL4176523)
Affinity DataKd:  7.00E+4nM. Assay description: Binding affinity to N-terminal His6-tagged p53 DNA binding domain Y220C mutant (94 to 312 residues) (unknown origin) expressed in Escherichia coli C4...
In DepthDetails ArticlePubMed