BDBM50404588 CHEMBL354135
SMILES CCC1CCN(CC1)C(=O)C(CCCNC(N)=N)NS(=O)(=O)c1cccc2c(OC(C)C)cccc12
InChI Key InChIKey=CUJTYVUUZTXKSN-UHFFFAOYSA-N
Data  1 IC50
  Tab Delimited (TSV)   2D SDfile   Computed 3D by Vconf -m prep SDfile
Find this compound or compounds like it in BindingDB:
Activity Spreadsheet -- Enzyme Inhibition Constant Data from BindingDB
Found 1 hit for monomerid = 50404588
TargetProthrombin(Bos taurus (Bovine))
TBA
Curated by ChEMBL
LigandPNGBDBM50404588(CHEMBL354135)
Affinity DataIC50:  4.00E+9nM. Assay description: Bovine thrombin concentration at which clotting time was prolonged 2x over the control.
In DepthDetails ArticlePubMed