BDBM50404923 CHEMBL72244
SMILES Cc1nc2ccc(Cl)cc2[nH]1
InChI Key InChIKey=NICFDLORAOTXMD-UHFFFAOYSA-N
Data  1 IC50
  Tab Delimited (TSV)   2D SDfile   Computed 3D by Vconf -m prep SDfile
Find this compound or compounds like it in BindingDB:
Activity Spreadsheet -- Enzyme Inhibition Constant Data from BindingDB
Found 1 hit for monomerid = 50404923
TargetCytochrome P450 2B1(Rattus norvegicus)
TBA
Curated by ChEMBL
LigandPNGBDBM50404923(CHEMBL72244)
Affinity DataIC50:  1.51E+5nM. Assay description: Inhibitory potency to aminopyrine N-demethylase activity (P450) in hepatic microsomes from phenobarbitone-induced rats.
In DepthDetails ArticlePubMed