BDBM50404976 CHEMBL172431
SMILES OC(CNC1CC1)COc1ccc(cc1)-c1ncc[nH]1
InChI Key InChIKey=DYQWWWOLSWZEAF-UHFFFAOYSA-N
Data  2 Kd
  Tab Delimited (TSV)   2D SDfile   Computed 3D by Vconf -m prep SDfile
Find this compound or compounds like it in BindingDB:
Activity Spreadsheet -- Enzyme Inhibition Constant Data from BindingDB
Found 2 hits for monomerid = 50404976
TargetBeta-2 adrenergic receptor(GUINEA PIG)
TBA
Curated by ChEMBL
LigandPNGBDBM50404976(CHEMBL172431)
Affinity DataKd:  1.07E+5nM. Assay description: In vitro beta-2 adrenergic receptor activity was determined by measuring inhibition of the isoproterenol induced relaxation in isolated guinea pig tr...
In DepthDetails ArticlePubMed
TargetBeta-1 adrenergic receptor(GUINEA PIG)
TBA
Curated by ChEMBL
LigandPNGBDBM50404976(CHEMBL172431)
Affinity DataKd:  676nM. Assay description: In vitro beta-1 adrenergic receptor activity was determined via inhibition of the positive chronotropic actions of isoproterenol in isolated guinea p...
In DepthDetails ArticlePubMed