BDBM50404987 CHEMBL3085291
SMILES CC(C)(C)NC[C@H](O)COc1ccc(cc1)-c1nc(c[nH]1)C(F)(F)F
InChI Key InChIKey=OHUGUDLAWZZRCF-LBPRGKRZSA-N
Data  2 Kd
  Tab Delimited (TSV)   2D SDfile   Computed 3D by Vconf -m prep SDfile
Find this compound or compounds like it in BindingDB:
Activity Spreadsheet -- Enzyme Inhibition Constant Data from BindingDB
Found 2 hits for monomerid = 50404987
TargetBeta-2 adrenergic receptor(GUINEA PIG)
TBA
Curated by ChEMBL
LigandPNGBDBM50404987(CHEMBL3085291)
Affinity DataKd:  8.91nM. Assay description: In vitro beta-2 adrenergic receptor activity was determined by measuring inhibition of the isoproterenol induced relaxation in isolated guinea pig tr...
In DepthDetails ArticlePubMed
TargetBeta-1 adrenergic receptor(GUINEA PIG)
TBA
Curated by ChEMBL
LigandPNGBDBM50404987(CHEMBL3085291)
Affinity DataKd:  0.891nM. Assay description: In vitro beta-1 adrenergic receptor activity was determined via inhibition of the positive chronotropic actions of isoproterenol in isolated guinea p...
In DepthDetails ArticlePubMed