BDBM50404990 CHEMBL177860
SMILES COc1ccc(CC(C)(C)NCC(O)COc2ccc(cc2)-c2nc(c[nH]2)-c2cccs2)cc1OC
InChI Key InChIKey=GHOOLNQEESNSKW-UHFFFAOYSA-N
Data  2 Kd
  Tab Delimited (TSV)   2D SDfile   Computed 3D by Vconf -m prep SDfile
Find this compound or compounds like it in BindingDB:
Activity Spreadsheet -- Enzyme Inhibition Constant Data from BindingDB
Found 2 hits for monomerid = 50404990
TargetBeta-2 adrenergic receptor(GUINEA PIG)
TBA
Curated by ChEMBL
LigandPNGBDBM50404990(CHEMBL177860)
Affinity DataKd:  3.63E+4nM. Assay description: In vitro beta-2 adrenergic receptor activity was determined by measuring inhibition of the isoproterenol induced relaxation in isolated guinea pig tr...
In DepthDetails ArticlePubMed
TargetBeta-1 adrenergic receptor(GUINEA PIG)
TBA
Curated by ChEMBL
LigandPNGBDBM50404990(CHEMBL177860)
Affinity DataKd:  9.10nM. Assay description: In vitro beta-1 adrenergic receptor activity was determined via inhibition of the positive chronotropic actions of isoproterenol in isolated guinea p...
In DepthDetails ArticlePubMed