BDBM50405021 CHEMBL26607
SMILES CC(C)(C)NCC(O)COC(C1CC1)C1CC1
InChI Key InChIKey=VEVOYGOKIZRJNA-UHFFFAOYSA-N
Data  2 Kd
  Tab Delimited (TSV)   2D SDfile   Computed 3D by Vconf -m prep SDfile
Find this compound or compounds like it in BindingDB:
Activity Spreadsheet -- Enzyme Inhibition Constant Data from BindingDB
Found 2 hits for monomerid = 50405021
TargetBeta-2 adrenergic receptor(GUINEA PIG)
TBA
Curated by ChEMBL
LigandPNGBDBM50405021(CHEMBL26607)
Affinity DataKd:  3.09E+4nM. Assay description: Beta-2 adrenergic receptor blocking activity in trachea of guinea pig.
In DepthDetails ArticlePubMed
TargetBeta-1 adrenergic receptor(GUINEA PIG)
TBA
Curated by ChEMBL
LigandPNGBDBM50405021(CHEMBL26607)
Affinity DataKd:  3.09E+4nM. Assay description: Beta-1 adrenergic receptor blocking activity in atria of guinea pig.
In DepthDetails ArticlePubMed