BDBM50405036 CHEMBL33179
SMILES CC1(C)N=C(N)N=C(N)N1c1ccc(SCc2ccccc2)c(Cl)c1
InChI Key InChIKey=CIWCAKCCJMNWMV-UHFFFAOYSA-N
Data  1 KI
  Tab Delimited (TSV)   2D SDfile   Computed 3D by Vconf -m prep SDfile
Find this compound or compounds like it in BindingDB:
Activity Spreadsheet -- Enzyme Inhibition Constant Data from BindingDB
Found 1 hit for monomerid = 50405036
TargetDihydrofolate reductase(Gallus gallus (Chicken))
TBA
Curated by ChEMBL
LigandPNGBDBM50405036(CHEMBL33179)
Affinity DataKi:  40nM. Assay description: Inhibitory activity against isolated chicken liver dihydrofolate reductase (DHFR)
In DepthDetails ArticlePubMed