BDBM50405068 CHEMBL34274
SMILES CC1(C)N=C(N)N=C(N)N1c1cccc(COC2CCCCC2)c1
InChI Key InChIKey=VBTPIRBEIMLOSF-UHFFFAOYSA-N
Data  2 KI
  Tab Delimited (TSV)   2D SDfile   Computed 3D by Vconf -m prep SDfile
Find this compound or compounds like it in BindingDB:
Activity Spreadsheet -- Enzyme Inhibition Constant Data from BindingDB
Found 2 hits for monomerid = 50405068
TargetDihydrofolate reductase(Gallus gallus (Chicken))
TBA
Curated by ChEMBL
LigandPNGBDBM50405068(CHEMBL34274)
Affinity DataKi:  65nM. Assay description: Inhibitory activity against isolated chicken liver dihydrofolate reductase (DHFR)
In DepthDetails ArticlePubMed
TargetDihydrofolate reductase(Lactobacillus casei)
TBA
Curated by ChEMBL
LigandPNGBDBM50405068(CHEMBL34274)
Affinity DataKi:  2.04E+3nM. Assay description: Inhibitory activity against Lactobacillus casei dihydrofolate reductase (DHFR)
In DepthDetails ArticlePubMed