BDBM50405176 CHEMBL542817
SMILES CSC(=N)NCCSCc1[nH]cnc1C
InChI Key InChIKey=NFFZZKNNGKFMDC-UHFFFAOYSA-N
Data  1 Kd
  Tab Delimited (TSV)   2D SDfile   Computed 3D by Vconf -m prep SDfile
Find this compound or compounds like it in BindingDB:
Activity Spreadsheet -- Enzyme Inhibition Constant Data from BindingDB
Found 1 hit for monomerid = 50405176
TargetHistamine H2 receptor(Cavia porcellus (domestic guinea pig))
TBA
Curated by ChEMBL
LigandPNGBDBM50405176(CHEMBL542817)
Affinity DataKd:  6.92E+3nM. Assay description: Antagonistic activity against H2 receptor in guinea pig.
In DepthDetails ArticlePubMed