BDBM50405198 CHEMBL52356
SMILES CCCCCC(=O)C(CCCC)c1oc(=O)c(CCCC)c(OC(C)=O)c1CCCC
InChI Key InChIKey=HCQGETOIRMHVAF-UHFFFAOYSA-N
Data  2 KI
  Tab Delimited (TSV)   2D SDfile   Computed 3D by Vconf -m prep SDfile
Find this compound or compounds like it in BindingDB:
Activity Spreadsheet -- Enzyme Inhibition Constant Data from BindingDB
Found 2 hits for monomerid = 50405198
TargetChymotrypsin-like elastase family member 1(Sus scrofa (Pig))
TBA
Curated by ChEMBL
LigandPNGBDBM50405198(CHEMBL52356)
Affinity DataKi:  8.13E+3nM. Assay description: Inhibitory activity against porcine pancreatic elastase (PP elastase) expressed as inhibitory constant
In DepthDetails ArticlePubMed
TargetChymotrypsin-C(Homo sapiens (Human))
TBA
Curated by ChEMBL
LigandPNGBDBM50405198(CHEMBL52356)
Affinity DataKi:  1.91E+5nM. Assay description: Inhibitory activity against bovine Chymotrypsinogen expressed as inhibitory constant
In DepthDetails ArticlePubMed