BDBM50405199 CHEMBL56016
SMILES CCCCc1c(CC(C)O)oc(=O)c(CCCC)c1OC(C)=O
InChI Key InChIKey=OCFGJTQPYXEAAJ-UHFFFAOYSA-N
Data  3 KI
  Tab Delimited (TSV)   2D SDfile   Computed 3D by Vconf -m prep SDfile
Find this compound or compounds like it in BindingDB:
Activity Spreadsheet -- Enzyme Inhibition Constant Data from BindingDB
Found 3 hits for monomerid = 50405199
TargetNeutrophil elastase(Homo sapiens (Human))
TBA
Curated by ChEMBL
LigandPNGBDBM50405199(CHEMBL56016)
Affinity DataKi:  3.47E+5nM. Assay description: Inhibitory activity against human leukocyte elastase (HL elastase) expressed as inhibitory constant
In DepthDetails ArticlePubMed
TargetChymotrypsin-C(Homo sapiens (Human))
TBA
Curated by ChEMBL
LigandPNGBDBM50405199(CHEMBL56016)
Affinity DataKi:  7.08E+5nM. Assay description: Inhibitory activity against bovine Chymotrypsinogen expressed as inhibitory constant
In DepthDetails ArticlePubMed
TargetChymotrypsin-like elastase family member 1(Sus scrofa (Pig))
TBA
Curated by ChEMBL
LigandPNGBDBM50405199(CHEMBL56016)
Affinity DataKi:  1.07E+6nM. Assay description: Inhibitory activity against porcine pancreatic elastase (PP elastase) expressed as inhibitory constant
In DepthDetails ArticlePubMed