BDBM50405479 CHEMBL2028988
SMILES CC[C@H](C)[C@H](NC(=O)[C@@H](NC(O)[C@H](CC(C)C)NC(=O)[C@H](Cc1cnc[nH]1)NC(=O)[C@H](Cc1ccccc1)NC(=O)[C@@H]1CCCN1C(=O)[C@H](Cc1cnc[nH]1)NC(=O)OC(C)(C)C)C(C)C)C(=O)N[C@@H](Cc1cnc[nH]1)C(O)=O
InChI Key InChIKey=UIOXZRLXAROYRL-UUMJJOABSA-N
Data  1 IC50
  Tab Delimited (TSV)   2D SDfile   Computed 3D by Vconf -m prep SDfile
Find this compound or compounds like it in BindingDB:
Activity Spreadsheet -- Enzyme Inhibition Constant Data from BindingDB
Found 1 hit for monomerid = 50405479
TargetRenin(Homo sapiens (Human))
Abbott Laboratories
Curated by ChEMBL
LigandPNGBDBM50405479(CHEMBL2028988)
Affinity DataIC50:  0.700nM. Assay description: Inhibition against human plasma renin
In DepthDetails ArticlePubMed