BDBM50405480 CHEMBL4167970
SMILES CC#CC(CC(O)=O)c1ccc(OCc2ccc(s2)C(=O)N2CCN(CC2)c2ccc(cc2)[N+]([O-])=O)cc1
InChI Key InChIKey=AJLFOPYRIVGYMJ-UVBCTXHOSA-N
Data  1 EC50
  Tab Delimited (TSV)   2D SDfile   Computed 3D by Vconf -m prep SDfile
Find this compound or compounds like it in BindingDB:
Activity Spreadsheet -- Enzyme Inhibition Constant Data from BindingDB
Found 1 hit for monomerid = 50405480
TargetFree fatty acid receptor 1(Homo sapiens (Human))
Chinese Academy Of Sciences
Curated by ChEMBL
LigandPNGBDBM50405480(CHEMBL4167970)
Affinity DataEC50:  231nM. Assay description: Agonist activity at human GPR40 expressed in HEK293 cells assessed as increase in calcium mobilization by Fluo-8 dye based fluorescence assay
In DepthDetails ArticlePubMed