BDBM50405504 CHEMBL60029
SMILES CCc1ccc(Cc2cnc(N)nc2N)cc1
InChI Key InChIKey=XQPXBKQHMJVIHI-UHFFFAOYSA-N
Data  2 IC50
  Tab Delimited (TSV)   2D SDfile   Computed 3D by Vconf -m prep SDfile
Find this compound or compounds like it in BindingDB:
Activity Spreadsheet -- Enzyme Inhibition Constant Data from BindingDB
Found 1 hit for monomerid = 50405504
TargetReplicase polyprotein 1ab(2019-nCoV)TBA
LigandPNGBDBM50405504(CHEMBL3916514)
Affinity DataIC50:  320nM. Assay description: In vitro inhibitory activity against Angiotensin I converting enzyme
In DepthDetails