BDBM50405619 CHEMBL419994
SMILES Cc1cccc(OC[C@@H](O)[C@@H]2CCCCN2)c1
InChI Key InChIKey=PMIQTCHQVGVLMI-UONOGXRCSA-N
Data  2 Kd
  Tab Delimited (TSV)   2D SDfile   Computed 3D by Vconf -m prep SDfile
Find this compound or compounds like it in BindingDB:
Activity Spreadsheet -- Enzyme Inhibition Constant Data from BindingDB
Found 1 hit for monomerid = 50405619
TargetKelch-like ECH-associated protein 1(Homo sapiens (Human))TBA
LigandPNGBDBM50405619(CHEMBL5275178)
Affinity DataIC50:  98nM. Assay description: Inhibition of Phosphodiesterase 2 from pig coronary artery
In DepthDetails