BDBM50405696 CHEMBL4166005
SMILES CC#CC(CC(O)=O)c1ccc(OCc2ccc(o2)C(=O)N2CCN(CC2)c2ccc(F)cc2)cc1
InChI Key InChIKey=SWKDKPVRLQUCEM-SFYZADRCSA-N
Data  1 EC50
  Tab Delimited (TSV)   2D SDfile   Computed 3D by Vconf -m prep SDfile
Find this compound or compounds like it in BindingDB:
Activity Spreadsheet -- Enzyme Inhibition Constant Data from BindingDB
Found 1 hit for monomerid = 50405696
TargetFree fatty acid receptor 1(Homo sapiens (Human))
Chinese Academy Of Sciences
Curated by ChEMBL
LigandPNGBDBM50405696(CHEMBL4166005)
Affinity DataEC50:  308nM. Assay description: Agonist activity at human GPR40 expressed in HEK293 cells assessed as increase in calcium mobilization by Fluo-8 dye based fluorescence assay
Ligand InfoPC cidPC sid
In DepthDetails ArticlePubMed