BDBM50405781 CHEMBL2369814
SMILES CCNC(=O)[C@@H]1CCCN1C(=O)[C@H](CCCN=C(N)N)NC(=O)[C@H](CC(C)C)NC(=O)[C@@H](Cc1c[nH]c2ccccc12)NC(=O)[C@H](Cc1ccc(O)cc1)NC(=O)[C@H](CO)NC(=O)[C@@H](N)Cc1c[nH]c2ccccc12
InChI Key InChIKey=JHLSOUWURHSRJH-JCYOZFERSA-N
Data  1 KI
  Tab Delimited (TSV)   2D SDfile   Computed 3D by Vconf -m prep SDfile
Find this compound or compounds like it in BindingDB:
Activity Spreadsheet -- Enzyme Inhibition Constant Data from BindingDB
Found 1 hit for monomerid = 50405781
TargetLutropin-choriogonadotropic hormone receptor(Rattus norvegicus)
Abbott Laboratories
Curated by ChEMBL
LigandPNGBDBM50405781(CHEMBL2369814)
Affinity DataKi:  4.70nM. Assay description: In vitro binding affinity for Luteinizing hormone releasing hormone receptor from rat pituitary cells, expressed as negative logarithm of the equilib...
In DepthDetails ArticlePubMed