BDBM50406153 CHEMBL101625
SMILES CCc1ccccc1NC(=O)CCN1CCN2Cc3[nH]c4ccccc4c3CC2C1
InChI Key InChIKey=ULPVRDIUCGXCNO-UHFFFAOYSA-N
Data  1 IC50
  Tab Delimited (TSV)   2D SDfile   Computed 3D by Vconf -m prep SDfile
Find this compound or compounds like it in BindingDB:
Activity Spreadsheet -- Enzyme Inhibition Constant Data from BindingDB
Found 1 hit for monomerid = 50406153
TargetSon of sevenless homolog 1(Homo sapiens (Human))TBA
LigandPNGBDBM50406153(CHEMBL5290547)
Affinity DataIC50:  72nM. Assay description: In vitro inhibitory effect of histamine H3 antagonist on the electrically evoked contractile response of isolated guinea pig jejunum segments.
In DepthDetails