BDBM50406156 CHEMBL101973
SMILES CCc1ccccc1NC(=O)CCN1CCC(Cc2ccccc2)CC1
InChI Key InChIKey=PGUJYTCXPVJDRD-UHFFFAOYSA-N
Data  1 IC50
  Tab Delimited (TSV)   2D SDfile   Computed 3D by Vconf -m prep SDfile
Find this compound or compounds like it in BindingDB:
Activity Spreadsheet -- Enzyme Inhibition Constant Data from BindingDB
Found 1 hit for monomerid = 50406156
TargetSon of sevenless homolog 1(Homo sapiens (Human))TBA
LigandPNGBDBM50406156(CHEMBL5288585)
Affinity DataIC50: >5.00E+3nM. Assay description: In vitro inhibitory effect of histamine H3 antagonist on the electrically evoked contractile response of isolated guinea pig jejunum segments.
In DepthDetails