BDBM50406405 CHEMBL2062124::U-72409E
SMILES CC[C@H](C)[C@H](NC(=O)C[C@H](O)[C@H](CC(C)C)NC(=O)[C@H](Cc1cnc[nH]1)NC(=O)[C@H](Cc1ccccc1)NC(=O)[C@@H]1CCCN1C(=O)[C@H](Cc1cnc[nH]1)NC(C)=O)C(N)=O
InChI Key InChIKey=CDISWMCLLRNTSQ-KAJBDHFLSA-N
Data  1 Kd
  Tab Delimited (TSV)   2D SDfile   Computed 3D by Vconf -m prep SDfile
Find this compound or compounds like it in BindingDB:
Activity Spreadsheet -- Enzyme Inhibition Constant Data from BindingDB
Found 1 hit for monomerid = 50406405
TargetRenin(Homo sapiens (Human))
Upjohn
Curated by ChEMBL
LigandPNGBDBM50406405(CHEMBL2062124 | U-72409E)
Affinity DataKd:  23nM. Assay description: Dissociation constant (Kd) of renin inhibitor was determined over a temperature range of 8-37 degree by the fluorescence displacement assay
In DepthDetails ArticlePubMed