BDBM50406470 Kibdelomycin
SMILES [H][C@@]1(C[C@@](O)([C@H](C)NC(=O)c2[nH]c(C)c(Cl)c2Cl)[C@H](O)[C@@H](C)O1)O[C@@H]1CCC(=C)[C@]2([H])C([C@@H](C)C=C[C@@]12[H])C(\O)=C1/C(=O)[C@H](C(C)C)N([C@H]2O[C@H](C)[C@H](OC(N)=O)[C@H](OC(C)=O)[C@@H]2OC)C1=O
InChI Key InChIKey=AYDSBKMPDDZABS-UHFFFAOYSA-N
Data  2 IC50
  Tab Delimited (TSV)   2D SDfile   Computed 3D by Vconf -m prep SDfile
Find this compound or compounds like it in BindingDB:
Activity Spreadsheet -- Enzyme Inhibition Constant Data from BindingDB
Found 2 hits for monomerid = 50406470
TargetDNA gyrase subunit A/B(Staphylococcus aureus)
Merck Research Laboratories
Curated by ChEMBL
LigandPNGBDBM50406470(Kibdelomycin)
Affinity DataIC50:  9nM. Assay description: Inhibition of Staphylococcus aureus DNA gyrase
In DepthDetails ArticlePubMed
TargetDNA gyrase subunit B(Staphylococcus aureus)
Islamia College University
Curated by ChEMBL
LigandPNGBDBM50406470(Kibdelomycin)
Affinity DataIC50:  9nM. Assay description: Inhibition of Staphylococcus aureus GyrB
In DepthDetails ArticlePubMed