BDBM50406630 CHEMBL60482
SMILES CC(C)CCNC(=O)[C@H](CC(C)C)NC(=O)[C@H]1O[C@@H]1C(=O)NCCc1c[nH]c2ccc(O)cc12
InChI Key InChIKey=NPCYNHXMFOOEQQ-FKBYEOEOSA-N
Data  2 IC50
  Tab Delimited (TSV)   2D SDfile   Computed 3D by Vconf -m prep SDfile
Find this compound or compounds like it in BindingDB:
Activity Spreadsheet -- Enzyme Inhibition Constant Data from BindingDB
Found 2 hits for monomerid = 50406630
TargetToll-like receptor 1(Homo sapiens)TBA
LigandPNGBDBM50406630(CHEMBL5282603)
Affinity DataEC50: >5.00E+3nM. Assay description: Antagonism of guinea pig ileum contraction at 100 nM mepyramine
In DepthDetails
TargetToll-like receptor 1(Homo sapiens)TBA
LigandPNGBDBM50406630(CHEMBL5282603)
Affinity DataEC50: >5.00E+3nM. Assay description: Blocking 5-HT2A receptor-mediated contractions of rat tail artery
In DepthDetails