BDBM50406942 CHEMBL80665
SMILES C[C@H](NC(CCC(=O)Nc1ccc(I)cc1)C(O)=O)C(=O)N1CCC[C@H]1C(O)=O
InChI Key InChIKey=AMUOMYNSVLFGSU-NGKXAEKTSA-N
Data  2 IC50
  Tab Delimited (TSV)   2D SDfile   Computed 3D by Vconf -m prep SDfile
Find this compound or compounds like it in BindingDB:
Activity Spreadsheet -- Enzyme Inhibition Constant Data from BindingDB
Found 2 hits for monomerid = 50406942
TargetAngiotensin-converting enzyme(Homo sapiens (Human))
Washington University
Curated by ChEMBL
LigandPNGBDBM50406942(CHEMBL80665)
Affinity DataIC50:  0.229nM. Assay description: Inhibitory activity against angiotensin converting enzyme (ACE)
In DepthDetails ArticlePubMed
TargetAngiotensin-converting enzyme(Homo sapiens (Human))
Washington University
Curated by ChEMBL
LigandPNGBDBM50406942(CHEMBL80665)
Affinity DataIC50:  0.794nM. Assay description: Inhibition of angiotensin I converting enzyme in silico
In DepthDetails ArticlePubMed