BDBM50406953 CHEMBL309798
SMILES OC(=O)[C@@H]1CCCN1C(=O)CP(O)(=O)C(CCc1ccccc1)NC(=O)c1ccccc1
InChI Key InChIKey=XLHBUNPXTBYPMK-XJDOXCRVSA-N
Data  1 IC50
  Tab Delimited (TSV)   2D SDfile   Computed 3D by Vconf -m prep SDfile
Find this compound or compounds like it in BindingDB:
Activity Spreadsheet -- Enzyme Inhibition Constant Data from BindingDB
Found 1 hit for monomerid = 50406953
TargetAngiotensin-converting enzyme(Homo sapiens (Human))
Washington University
Curated by ChEMBL
LigandPNGBDBM50406953(CHEMBL309798)
Affinity DataIC50:  72nM. Assay description: Inhibitory activity against angiotensin converting enzyme (ACE)
In DepthDetails ArticlePubMed