BDBM50407047 CHEMBL421909
SMILES CC[C@H](C)CNC(=O)[C@H](C(C)C)C(O)C(O)C(Cc1cnc[nH]1)NC(=O)COc1ccccc1
InChI Key InChIKey=IYAOYLDRMGPGCP-FKJQQNCJSA-N
Data  1 IC50
  Tab Delimited (TSV)   2D SDfile   Computed 3D by Vconf -m prep SDfile
Find this compound or compounds like it in BindingDB:
Activity Spreadsheet -- Enzyme Inhibition Constant Data from BindingDB
Found 1 hit for monomerid = 50407047
TargetGag-Pol polyprotein [489-587](Human immunodeficiency virus type 1)
Washington University
Curated by ChEMBL
LigandPNGBDBM50407047(CHEMBL421909)
Affinity DataIC50:  809nM. Assay description: Inhibitory potency against HIV-1 protease
In DepthDetails ArticlePubMed