BDBM50407058 CHEMBL134160
SMILES COC(=O)[C@@H](NC(=O)[C@H](CC(C)C)NC(=O)[C@@H]1CCCN1C[C@@H](O)[C@H](Cc1ccccc1)NC(=O)[C@H](CC(N)=O)NC(=O)[C@H](CC(C)C)NC(=O)C(CO)NC(C)=O)C(C)C
InChI Key InChIKey=FMIUAZWGOLVUSE-UFCSYJQJSA-N
Data  1 IC50
  Tab Delimited (TSV)   2D SDfile   Computed 3D by Vconf -m prep SDfile
Find this compound or compounds like it in BindingDB:
Activity Spreadsheet -- Enzyme Inhibition Constant Data from BindingDB
Found 1 hit for monomerid = 50407058
TargetGag-Pol polyprotein [489-587](Human immunodeficiency virus type 1)
Washington University
Curated by ChEMBL
LigandPNGBDBM50407058(CHEMBL134160)
Affinity DataIC50:  3.40nM. Assay description: Inhibitory potency against HIV-1 protease
In DepthDetails ArticlePubMed